Clojure-Contrib

java.jmx build failure due to missing JAR

Details

  • Type: Defect Defect
  • Status: Resolved Resolved
  • Priority: Critical Critical
  • Resolution: Declined
  • Affects Version/s: None
  • Fix Version/s: None
  • Component/s: None
  • Labels:
    None
  • Environment:
    Mac OS X Lion, Maven 3.0.3, JDK 1.6.0_26

Description

Appears to be a problem with parent POM:

[INFO] ------------------------------------------------------------------------
[INFO] BUILD FAILURE
[INFO] ------------------------------------------------------------------------
[INFO] Total time: 3.663s
[INFO] Finished at: Fri Aug 19 14:58:52 EDT 2011
[INFO] Final Memory: 6M/81M
[INFO] ------------------------------------------------------------------------
[ERROR] Failed to execute goal org.apache.maven.plugins:maven-surefire-plugin:2.7.2:test (default-test) on project java.jmx: Error to resolving surefire provider dependency: Missing:
[ERROR] ----------
[ERROR] 1) org.apache.maven.surefire:surefire-junit3:jar:2.7.2
[ERROR]
[ERROR] Try downloading the file manually from the project website.
[ERROR]
[ERROR] Then, install it using the command:
[ERROR] mvn install:install-file -DgroupId=org.apache.maven.surefire -DartifactId=surefire-junit3 -Dversion=2.7.2 -Dpackaging=jar -Dfile=/path/to/file
[ERROR]
[ERROR] Alternatively, if you host your own repository you can deploy the file there:
[ERROR] mvn deploy:deploy-file -DgroupId=org.apache.maven.surefire -DartifactId=surefire-junit3 -Dversion=2.7.2 -Dpackaging=jar -Dfile=/path/to/file -Durl=[url] -DrepositoryId=[id]
[ERROR]
[ERROR] Path to dependency:
[ERROR] 1) dummy:dummy:jar:1.0
[ERROR] 2) org.apache.maven.surefire:surefire-junit3:jar:2.7.2
[ERROR]
[ERROR] ----------
[ERROR] 1 required artifact is missing.
[ERROR]
[ERROR] for artifact:
[ERROR] dummy:dummy:jar:1.0

Activity

Aaron Bedra made changes -
Field Original Value New Value
Status Open [ 1 ] Resolved [ 5 ]
Resolution Declined [ 2 ]

People

Vote (0)
Watch (0)

Dates

  • Created:
    Updated:
    Resolved: